{"text_format":"1","workbook":"xlsx","n_sheets":16,"sheets":["Home","About","Content","Description","Investment volume","Externalities - Implementation","Operating results","Externalities - Operation","Indirect Externalities","Result table","Result chart","List of abbr. and definitions","Sources","Imprint | Disclaimer","Appendix - Input data","VBA"],"not_rendered":{"charts":1,"images":5,"macros":1,"external_links":0,"defined_names":101,"comments":0,"pivot_tables":0},"unopened":[],"bounds":{"document_bytes":16777216,"sheet_cells":100000,"rows_first":2000,"rows_last":500,"rows_between":2000,"halvings":0,"cell_chars":16384,"cell_head_chars":4096},"cells_cut":0,"cells_raw":0,"read":"whole","date_system":"1900"}

{"sheet":"Home","index":0,"n_rows":29,"n_cols":2,"rows_kept":29,"cut":false,"hidden":false,"merged":[]}
[]
[]
[]
[]
[]
[]
[]
[]
[]
[null,"DUAL Ports - Developing Low carbon Utilities, Abilities and potential of regional entrepreneurial Ports"]
[null,"Developing low carbon port potential: Cost benefit & carbon footprint analyses "]
[]
[null,"Please fill in all red cells!"]
[]
[null,"Version 3.5"]
[null,{"$f":"DATE(2018,10,16)","v":"2018-10-16"}]
[]
[]
[]
[]
{"$rows_left_out":10}
{"sheet":"About","index":1,"n_rows":7,"n_cols":2,"rows_kept":7,"cut":false,"hidden":false,"merged":[[6,11,6,12],[7,11,7,12],[8,11,8,12],[6,1,9,10]]}
["Home ⌂"]
[null,"About"]
[]
[null,"Developing low carbon port potential: "]
[null,"Cost benefit & carbon footprint analyses "]
[]
[null,"A cost-benefit analysis - CBA - is tool used to evaluate an investment decision in order to assess the welfare change attributable to it. It gives further information to the relevance of the contribution to EU cohesion policy objectives. The overall purpose of CBA is to facilitate a more efficient allocation of resources. A CBA demonstrates further the convenience for society of a particular (political) intervention (EC 2014, 15).\n\nThis CBA tool focuses to calculate the carbon footprint of investment projects. \n\nThe instrument shall be:\n- simple and transparent;\n- capable of being integrated into  and transfered to other projects; and\n- comply with existent and upcoming standards.\n\nFurther requirements of this CBA-tool is to have a self-explanatory character with a simple and understanding design.\n\nUsual problems with CBA tools are:\n- the overreliance on data from past projects;\n- the use of subjective impressions in assessment;\n- inappropriate use of heuristics to derive money cost of the intangible elements; and\n- confirmation bias among project supporters.\n\nThe cost benefit and carbon footprint tool measures if the project's aim of 20% operation cost reduction, of 20% total cost reduction, and 10% emission reduction is fullfilled. In result, it further differentiate between the project realized performance (do-someting scenario) and the project target (reference scenario)."]

{"sheet":"Content","index":2,"n_rows":17,"n_cols":4,"rows_kept":17,"cut":false,"hidden":false,"merged":[]}
["Home ⌂"]
[null,"Content"]
[null,null,"Description","INPUT sheet"]
[null,"Home"]
[null,"About"]
[null,"Description","Short investment description.","Yes"]
[null,"Investment volume","Quantification of the investment costs and financing structure.","Yes"]
[null,"Externalities - Implementation","Quantification of energy and resource consumption and structure.","Yes"]
[null,"Operating results","Quantification of operating costs and revenues of the project.","Yes"]
[null,"Externalities - Operation","Environmental Impacts.","Yes"]
[null,"Indirect Externalities","Energy consumption","Yes"]
[null,"Result table","The main results of the calculation summerized in a table."]
[null,"Result chart","The main results of the calculation summerized in several charts."]
[null,"List of abbreviation and definitions","In the list of abbreviation and definitions useful hints relevant for the input data can be found."]
[null,"Sources","Used sources."]
[null,"Imprint and Disclaimer","Contact, imprint, and disclaimer"]
[null,"Appendix Input Data","Further input data needed for the calculation of the cost/benefit analysis. "]

{"sheet":"Description","index":3,"n_rows":70,"n_cols":3,"rows_kept":70,"cut":false,"hidden":false,"merged":[[28,1,36,2],[39,1,47,2],[7,2,8,2],[13,1,13,2]]}
["Home ⌂"]
["Content &","Project- INPUT"]
[]
[null,"Project information",{"$f":"IF(C5<>\"\",\"\",\"<< PLEASE, FILL IN >>\")","v":"<< PLEASE, FILL IN >>"}]
[null,"Beneficiary"]
[null,"Project name"]
[null,"Project country                      (please select from dropdown-list)","Belgium"]
[null,"Year of reporting",2017]
[null,"Click for further information"]
[]
[null,"General information",{"$f":"IF(C12<>\"\",\"\",\"<< PLEASE, FILL IN >>\")","v":"<< PLEASE, FILL IN >>"}]
[null,"Year of establishment"]
[null,"Type of port:                                (please select from dropdown-list)","Private Service Port (if Infrastructure (private); suprastructure (private); workers (private))"]
[null,"Information on your activities and services (please select):"]
[null,"Provided directly","Sub contracted"]
[]
[]
[]
[]
[]
{"$rows_left_out":51}
{"sheet":"Investment volume","index":4,"n_rows":19,"n_cols":5,"rows_kept":19,"cut":false,"hidden":false,"merged":[[18,3,18,4],[15,1,15,2]]}
["Home ⌂"]
["Content &","Investment volume - INPUT"]
[null,"This is only assigned to the project itself. If your project does not include investments. Only affects operating costs/revenues, skip this sheet."]
[]
[null,"Financial investment volume","Short description","Conventional investment\n(Click for further information)","Green investment\n(Click for further information)"]
[null,"Total investment costs - in Euro","Amount of financial resources needed to implement the project (over the whole implementation period)",0,0]
[null,"Scrap value after operation - in Euro\n(Click for further information)","Scrap value after the appraisal period/operation period. The operation period has to be entered on the sheet \"Operating results\".",0,0]
[]
[null,"Sources of finance\n(Click for further information)",null,"Conventional investment","Green investment"]
[]
[null,"EU co-financing  - in %",null,0,0]
[null,"Norwegian co-financing - in %",null,0,0]
[null,"Further public contribution - in %",null,0,0]
[null,"Loans - in %",null,1,1]
[null,"Equity - in %",null,0,0]
[null,null,null,{"$f":"IF(SUM(D11:D15)<>1,\"The provided financial information is implausible!\",\"\")","v":""},{"$f":"IF(SUM(E11:E15)<>1,\"The provided financial information is implausible!\",\"\")","v":""}]
[]
[null,"Interest rate on loans"]
[null,"interest rate (per annum) - in %","effective interest rate (p.a.) relevant for the project (no difference between conventional and green investment allowed)",0]

{"sheet":"Externalities - Implementation","index":5,"n_rows":33,"n_cols":6,"rows_kept":33,"cut":false,"hidden":false,"merged":[[8,2,12,2],[28,2,29,2],[30,2,31,2]]}
["Home ⌂"]
["Content &","Implementation/Construction: Environmental Impacts - INPUT"]
[null,"This sheet only refers to the implementation/construction of the investment, NOT to the operation."]
[]
[null,"Environmental Factors","Short description","Conventional investment","Green investment","Result"]
["A","Energy consumption for implementation\n(Click for further information)","Only energy consumption is relvevant here, not production (for others). "]
[null,"electricity (grid) - in kWh","Does not include consumed electricity from own production. National energymix assumed.",0,0]
[null,"optional: share of green grid electricity - in %","If the share of green (hydro, geothermal, wind, solar) electricity differs from the national mix, this can be entered here.",0,0]
[null,"electricity (own production)"]
[null,"hydropower - in kWh",null,0,0]
[null,"geothermal - in kWh",null,0,0]
[null,"wind - in kWh",null,0,0]
[null,"solar - in kWh",null,0,0]
[null,"fuel consumption"]
[null,"(truck) diesel - in kWh",null,0,0]
[null,"marine diesel - in kWh",null,0,0]
[null,"gasoline - in kWh",null,0,0]
[null,"heating oil - in kWh",null,0,0]
[null,"natural gas - in kWh",null,0,0]
[null,"liquid gas - in kWh",null,0,0]
{"$rows_left_out":14}
{"sheet":"Operating results","index":6,"n_rows":11,"n_cols":5,"rows_kept":11,"cut":false,"hidden":false,"merged":[[6,1,7,1],[6,3,7,3],[6,4,7,4],[8,1,9,1],[8,3,9,3],[8,4,9,4]]}
["Home ⌂"]
["Content &","Operating Revenues and Costs - INPUT"]
[null,"This sheet uses the concept of business units. A business unit is a part of the business providing a certain service for which it makes sense to define indivdual costs and revenues."]
[]
[null,null,"Short description","Conventional investment","Green investment"]
[null,"Appraisal period - in years","The appraisal period is usually the lifetime/operation period of the investment (max. 50 years).",{"$f":"E6","v":0},0]
[null,"Average annual operating revenue of the project-relevant business unit - in Euro","The revenues refer to the smallest business unit which still covers the whole project. The annual average refers to the appraisal period.",0,0]
[]
[null,"Average annual operating cost of the project-relevant business unit - in Euro","Operating costs include all the costs to operate and maintain (O&M) the new or upgraded service. Does not include capital costs.",0,0]
[null,null,"Click for further information"]
[null,"Average annual operating surplus - in Euro",null,{"$f":"D7-D9","v":0},{"$f":"E7-E9","v":0}]

{"sheet":"Externalities - Operation","index":7,"n_rows":33,"n_cols":6,"rows_kept":33,"cut":false,"hidden":false,"merged":[[8,2,12,2],[13,2,24,2]]}
["Home ⌂"]
["Content &","Operation: Environmental Impacts - INPUT"]
[null,"This refers again to the smallest business unit which still covers the whole project."]
[]
[null,"Environmental Factors","Short description","Conventional investment","Green investment","Result"]
["A","Energy consumption of business unit\n(Click for further information)","Only energy consumption is relvevant here, not production (for others). To be entered as annual averages."]
[null,"electricity (grid) - in kWh","Does not include consumed electricity from own production. National energymix assumed.",0,0]
[null,"share of green grid electricity - in %","automatically equal to the corresponding figure from the sheet \"Exernalities -  Implementation\"",{"$f":"'Externalities - Implementation'!D8","v":0},{"$f":"'Externalities - Implementation'!E8","v":0}]
[null,"electricity (own production)"]
[null,"hydropower - in kWh",null,0,0]
[null,"geothermal - in kWh",null,0,0]
[null,"wind - in kWh",null,0,0]
[null,"solar - in kWh",null,0,0]
[null,"fuel consumption"]
[null,"(truck) diesel - in kWh",null,0,0]
[null,"marine diesel - in kWh",null,0,0]
[null,"gasoline - in kWh",null,0,0]
[null,"heating oil - in kWh",null,0,0]
[null,"natural gas - in kWh",null,0,0]
[null,"liquid gas - in kWh",null,0,0]
{"$rows_left_out":14}
{"sheet":"Indirect Externalities","index":8,"n_rows":19,"n_cols":6,"rows_kept":19,"cut":false,"hidden":false,"merged":[]}
["Home ⌂"]
["Content &","Indirect Environmental Impacts - INPUT"]
[]
[]
[null,"Environmental Factors","Short description","Conventional investment","Green investment","Result"]
[null,"Customers: Energy consumption\n","Consumption of all relevant customers. Annual average over the appraisal period."]
[null,"fuel consumption"]
[null,"(truck) diesel - in kWh",null,0,0]
[null,"marine diesel - in kWh",null,0,0]
[null,"gasoline - in kWh",null,0,0]
[null,"heating oil - in kWh",null,0,0]
[null,"natural gas - in kWh",null,0,0]
[null,"liquid gas - in kWh",null,0,0]
[null,"lignite - in kWh",null,0,0]
[null,"stone coal (brikets) - in kWh",null,0,0]
[null,"stone coal (koks) - in kWh",null,0,0]
[null,"wood (peaces) - in kWh",null,0,0]
[null,"wood (pellets) - in kWh",null,0,0]
[null,"Sum of indirect annual energy consumption - in kWh","Click for further information",{"$f":"SUM(D8:D18)","v":0},{"$f":"SUM(E8:E18)","v":0}]

{"sheet":"Result table","index":9,"n_rows":26,"n_cols":6,"rows_kept":26,"cut":false,"hidden":false,"merged":[[4,1,4,2],[10,1,10,2],[11,1,11,2],[14,1,14,2],[12,1,12,2],[13,1,13,2]]}
["Home ⌂"]
["Content &","Result table"]
[]
[null,"CBA overview",null,"Conventional investment","Green investment"]
[null,"present value of financial inflows\n(Click for further information)",null,{"$f":"SUM('Appendix - Input data'!C159:BD159,'Appendix - Input data'!C162:BD162)","v":0},{"$f":"SUM('Appendix - Input data'!C172:BD172,'Appendix - Input data'!C175:BD175)","v":0}]
[null,"present value of financial outflows",null,{"$f":"SUM('Appendix - Input data'!C160:BD160,'Appendix - Input data'!C163:BD163)","v":0},{"$f":"SUM('Appendix - Input data'!C173:BD173,'Appendix - Input data'!C176:BD176)","v":0}]
[null,"net present value (private)",null,{"$f":"D5-D6","v":0},{"$f":"E5-E6","v":0}]
[null,"present value of evnironmental costs",null,{"$f":"SUM('Appendix - Input data'!C164:BE167)","v":0},{"$f":"SUM('Appendix - Input data'!C177:BE180)","v":0}]
[]
[null,"Benefit Cost Ratios and targets",null,"Conventional investment","Green investment","Result"]
[null,"Benefit Cost Ratio\n(Click for further information)",null,{"$f":"IF(D6<>0,D5/D6,0)","v":0},{"$f":"IF(E6<>0,E5/E6,0)","v":0},{"$f":"IF(E11>=1,CONCATENATE(\"With a BCR equal to \",ROUND(E11,2),\", the green investment is expected to be beneficial.\"),CONCATENATE(\"With a BCR equal to \",ROUND(E11,2),\", the benefits do not exceed the costs.\"))","v":"With a BCR equal to 0, the benefits do not exceed the costs."}]
[null,"Social Benefit-Cost Ratio \n(Click for further information)",null,{"$f":"IF(D6<>0,D5/(D6+D8),0)","v":0},{"$f":"IF(E6<>0,E5/(E6+E8),0)","v":0},{"$f":"IF(E12>=1,CONCATENATE(\"With a Social BCR equal to \",ROUND(E12,2),\", the green investment is expected to be beneficial.\"),CONCATENATE(\"With a Social BCR equal to \",ROUND(E12,2),\", the benefits do not exceed the costs.\"))","v":"With a Social BCR equal to 0, the benefits do not exceed the costs."}]
[null,"Target 1a: 20% operating cost reduction (€/a)",null,{"$f":"IF('Operating results'!D6>0,'Operating results'!D9,0)","v":0},{"$f":"IF('Operating results'!E6>0,'Operating results'!E9,0)","v":0},{"$f":"IF(D13<>0,IF(E13/D13<=0.8,CONCATENATE(\"Target is fulfilled (\",100*ROUND(1-E13/D13,2),\" %)\"),CONCATENATE(\"Target is not fulfilled (\",100*ROUND(1-E13/D13,2),\" %)\")),\"Target is not fulfilled\")","v":"Target is not fulfilled"}]
[null,"Target 1b: 20% total cost reduction (€)",null,{"$f":"D6","v":0},{"$f":"E6","v":0},{"$f":"IF(D14<>0,IF(E14/D14<=0.8,CONCATENATE(\"Target is fulfilled (\",100*ROUND(1-E14/D14,2),\" %)\"),CONCATENATE(\"Target is not fulfilled (\",100*ROUND(1-E14/D14,2),\" %)\")),\"Target is not fulfilled\")","v":"Target is not fulfilled"}]
[null,"Target 2: 10% carbon emission reduction (t CO2e)",null,{"$f":"'Operating results'!D6*('Appendix - Input data'!D58+'Appendix - Input data'!E85)+'Appendix - Input data'!H58+'Appendix - Input data'!E88","v":0},{"$f":"'Operating results'!E6*('Appendix - Input data'!E58+'Appendix - Input data'!E86)+'Appendix - Input data'!H77+'Appendix - Input data'!E89","v":0},{"$f":"IF(D15<>0,IF(E15/D15<=0.9,CONCATENATE(\"Target is fulfilled (\",100*ROUND(1-E15/D15,2),\" %)\"),CONCATENATE(\"Target is not fulfilled (\",100*ROUND(1-E15/D15,2),\" %)\")),\"Target is not fulfilled\")","v":"Target is not fulfilled"}]
[]
[null,"Direct environmental impacts",null,"Conventional investment","Green investment"]
[null,"CO2e [t]",null,{"$f":"('Appendix - Input data'!$D$58+'Appendix - Input data'!$E$85)*'Operating results'!D6+'Appendix - Input data'!$E$88+'Appendix - Input data'!$H$58","v":0},{"$f":"('Appendix - Input data'!$D$77+'Appendix - Input data'!$E$86)*'Operating results'!E6+'Appendix - Input data'!$E$89+'Appendix - Input data'!$H$77","v":0}]
[null,"sulphur [kg]",null,{"$f":"('Appendix - Input data'!$E$58*'Operating results'!D6+'Appendix - Input data'!$I$58)/1000","v":0},{"$f":"('Appendix - Input data'!$E$77*'Operating results'!E6+'Appendix - Input data'!$I$77)/1000","v":0}]
[null,"nitrogen [kg]",null,{"$f":"('Appendix - Input data'!$F$58*'Operating results'!D6+'Appendix - Input data'!$J$58)/1000","v":0},{"$f":"('Appendix - Input data'!$F$77*'Operating results'!E6+'Appendix - Input data'!$J$77)/1000","v":0}]
{"$rows_left_out":7}
{"sheet":"Result chart","index":10,"n_rows":26,"n_cols":5,"rows_kept":26,"cut":false,"hidden":false,"merged":[]}
["Home ⌂"]
["Content &","Result chart"]
[]
[]
[]
[]
[]
[]
[]
[]
[]
[]
[]
[]
[]
[]
[]
[]
[]
[]
{"$rows_left_out":7}
{"sheet":"List of abbr. and definitions","index":11,"n_rows":59,"n_cols":5,"rows_kept":59,"cut":false,"hidden":false,"merged":[[1,1,1,3]]}
["Home ⌂"]
["Content &","List of abbreviation and definitions"]
[]
[null,"Abbrivation",null,"Definition","Source"]
["A",null,"Additional costs of investment","These costs are composed of start-up and planning costs (incl. costs of construction phase, tender off etc.), land costs, buildings costs and damage to properties/compensation payment (inlc. for compensation area)."]
["top ↑",null,"(Annual average) energy consumption","The energy consumption that can be directly attributed to the investment project (e. g. indirect GHG emissions caused by e. g. transportation, heating, electricity). Lower overall consumption might therefore reduce indirect GHG emissions. To quantify the reduction in GHG emissions that is due to a change in the energy mix (e. g. wind instead of diesel) we require detailed information on the sources of energy consumption."]
[null,null,"Annual average GHGe savings that are not already included in category A and B","Values entered here indicate a reduction in GHG emissions that is not attributed to a lower (or greener) energy consumption of the project itself. This includes for example spillovers from the new investment project to other port areas that are not included in A or saving measures of the Green Officer."]
[null,null,"Avoided municipal cleaning costs by using polluted materials","It is seen as a positive social benefit if cleaning costs, that would otherwise accrue to the public (the municipality), are privatised. Cleaning costs are already part of the operating costs. Therefore we explicitly count cleaning costs, that would accrue to the municipality without the project, as internalisation of external effects on the benefit side. "]
["B","BCR","Benefit-cost ratio","A benefit-cost ratio (BCR)/Profitability Index Rate is an indicator, used in the formal discipline of cost-benefit analysis, that attempts to summarize the overall value for money of a project or proposal. A BCR is the ratio of the benefits of a project or proposal, expressed in monetary terms, relative to its costs, also expressed in monetary terms. All benefits and costs should be expressed in discounted present values. The higher the BCR the better the investment. General rule of thumb is that if the benefit is higher than the cost the project is a good investment."]
["top ↑",null,"Benefit-cost ratio including social benefit (Social-Benefit-Cost Ratio)","Same rationale as for the regular benefit-cost-ratio. Additionally social costs are explicitly quantified and their monetary value is included in the calculation. The internalisation of external effects is quantified and included as a benefit.  "]
[null,"BAU","Business-As-Usual (do-nothing)","The objectives of the project remains as it would be with no project (counterfactual scenario). The objective of the project includes costs (and revenues) to operate and maintain the service."]
["C","CO2e","CO2-equivalent"]
["top ↑","CI","Conventional investment","An investment project that would be realised if no green investment was implemented. This could possibly include investments that are needed to ensure the maintenance of the business as usual (see also BAU)."]
[null,"CBA","Cost-Benefit-Analysis"]
["D",null,"Damage of properties","Damage of properties of other "]
["top ↑","do-minimum","Do-minimum scenario","The objectives of the do-minimus scenario remains as it would be with no project (counterfactual scenario). The do-minimum scenario includes necessary improvment work/small adaptation investments."]
[null,"do-something","Do-something scenario","Represents changes to the objectives of the project (concentional/green investment)."]
["E","ECB","European central bank"]
["top ↑","EC","European Commission"]
[null,"EIB","European Investment Bank"]
{"$rows_left_out":40}
{"sheet":"Sources","index":12,"n_rows":14,"n_cols":2,"rows_kept":14,"cut":false,"hidden":false,"merged":[]}
["Home ⌂"]
["Content &","Sources"]
[]
[null,"David Pearce, D.; Atkinson, G.; Mourato, S. (2006): Cost-Benefit Analysis and the Environment - Recent Developments, OECD (eds.), Paris."]
[null,"Dijkgraaf, E.; Vollebergh, H. (2004): Burn or bury? A social cost comparison of final waste disposal methods, Ecological Economics 50 (2004) 233– 247."]
[null,"DUAL Ports (2017), Green officer, www.dualports.eu [access 11.10.2017]"]
[null,"European Central Bank (2017): MFI interest rate statistics, www.ecb.europa.eu, access 03.02.2017"]
[null,"European Commission (2014): Guide to Cost-Benefit-Analysis of Investment Projects, \nEconomic appraisal tool for Cohesion Policy 2014-2020, Brussels."]
[null,"European Environment Agency (1997): The Concept of Environmental Space - Implications for Policies, Environmental Reporting and Assessments, Copenhagen."]
[null,"European Investment Bank (2013): The Economic Appraisal of Investment Projects at the EIB, Projects Directorate, Luxemburg."]
[null,"European Investment Bank (2014): Induced GHG Footprint, Methodologies for the Assessment of Project GHG Emissions, Version 10.0, Luxemburg."]
[null,"Eurostat (2017): Diverse data, http://ec.europa.eu/eurostat/web/main/home [access 03.02.2017]"]
[null,"Internationale Institut für Nachhaltigkeitsanalysen und -strategien (IINAS) (2017): GEMIS - Globales Emissions-Modell integrierter Systeme, Version 4.95, http://iinas.org [access 01.06.2017]"]
[null,"Umweltbundesamt (2017): Prozessorientierte Basisdaten für Umweltmanagementsysteme, www.probas.umweltbundesamt.de [access 01.06.2017]"]

{"sheet":"Imprint | Disclaimer","index":13,"n_rows":26,"n_cols":4,"rows_kept":26,"cut":false,"hidden":false,"merged":[[25,1,26,12]]}
["Home ⌂"]
["Content &","DUAL Ports - Developing Low carbon Utilities, Abilities and potential of regional entrepreneurial Ports"]
[null,"Developing low carbon port potential: Cost benefit & carbon footprint analyses "]
[null,"Dr. Malte Jahn and Dr. Jan Wedemeier"]
[null,"Hamburg Institute of International Economics (HWWI) | 2018"]
[]
[null,"Corresponding author / Contact:"]
[]
[null,"Dr. Jan Wedemeier"]
[null,"Hamburg Institute of International Economics (HWWI)"]
[null,"Fahrenheitstr. 1                            "]
[null,"28359 Bremen | Germany"]
[null,"Phone +49 (0)421-2208 – 243 | +49 (0)40-340576 – 663"]
[null,"wedemeier@hwwi.org"]
[]
[null,"Hamburg Institute of International Economics (HWWI)"]
[null,"Baumwall 7"]
[null,"20459 Hamburg | Germany                              "]
[null,"Phone +49 (0)40-340576 – 0"]
[null,"info@hwwi.org | www.hwwi.org "]
{"$rows_left_out":7}
{"sheet":"Appendix - Input data","index":14,"n_rows":181,"n_cols":57,"rows_kept":181,"cut":false,"hidden":false,"merged":[[59,1,59,2],[15,2,15,7],[40,1,40,2]]}
["Home ⌂"]
["Content &","Appendix input data"]
[]
[null,"Public sector discount rate"]
[null,"top ↑","Definition →"]
[null,"Rate in %"]
[null,"Recommended financial discount rate according to article 19 of Commission Delegated Regulation (EU) No 480/2014, for the programming period 2014-2020. ",0]
[null,"Source: European Commission (2014)"]
[]
[null,"GHGe emissions"]
[null,"top ↑"]
[null,"Unit cost GHGe emissions in t"]
[null,"Description / Application"]
[null,"Cost of GHG emissions = VGHG*CGHG"]
[null,"where: ","VGHG ist the incremental volume of GHG emissions produced by the project, expressed in CO2 equivalents"]
[null,null,"CGHG is the damage cost of CO2"]
[null,null,"Value 2010 (Euro/t-CO2e)","Annual adders 2011-30 (in Euro)"]
[null,"High",40,2]
[null,"Central",25,1]
[null,"Low",10,0.5]
{"$rows_left_out":162}
{"sheet":"VBA","index":15,"n_rows":12,"n_cols":5,"rows_kept":12,"cut":false,"hidden":true,"merged":[]}
[]
[]
[]
[]
[null,null,null,null,"Zelleninhalte löschen"]
[null,null,null,null,"Range gibt dabei die Zellen an"]
[null,null,null,null,"Option Explicit\n\nSub Zellinhalte_löschen()\nRange(\"b46,C15,c16,c26,d26,c30,c31,c36,d36,e36,f36,c37,d37,e37,f37,d41:d43,d30:d31,g48,g47,c61,c62\").ClearContents\nEnd Sub"]
[]
[]
[null,null,null,null,"Scroll Area beschränken"]
[]
[null,null,null,null,"VBA starten, oben links die Tabelle auswählen und dann Zeile 1 bis X eingeben wie folgt: 1:X"]